{"text_format":"1","workbook":"xlsx","n_sheets":3,"sheets":["Cover Sheet","Rv and Adjusted CN","Sheet1"],"not_rendered":{"charts":0,"images":3,"macros":1,"external_links":0,"defined_names":3,"comments":0,"pivot_tables":0},"unopened":[],"bounds":{"document_bytes":16777216,"sheet_cells":100000,"rows_first":2000,"rows_last":500,"rows_between":2000,"halvings":0,"cell_chars":16384,"cell_head_chars":4096},"cells_cut":0,"cells_raw":0,"read":"whole","date_system":"1900"}

{"sheet":"Cover Sheet","index":0,"n_rows":44,"n_cols":15,"rows_kept":44,"cut":false,"hidden":false,"merged":[[24,8,39,8],[4,2,4,5],[17,8,23,8],[20,9,23,9],[17,9,19,9],[33,9,34,9],[31,9,32,9],[27,9,30,9],[24,9,26,9],[35,9,36,9],[0,8,0,15],[30,0,41,0],[30,1,31,1],[32,1,39,1],[40,1,41,1],[17,0,29,0],[17,1,29,1],[0,0,0,1],[2,0,2,1],[2,2,2,5],[1,0,1,1],[4,0,4,1],[0,2,0,5],[1,2,1,5],[3,0,3,1],[3,2,3,5]]}
["Project Name",null,null,null,null,null,null,null,"MWS LID SITE DESIGN TOOL VERSION 9 - August 1, 2016"]
["Parcel Identification #"]
["Engineer"]
["Address"]
["E-mail"]
[]
[]
[]
[]
[]
[]
[]
[]
[]
[]
[null,null,null,"Lookup Table",null,null,null,null,null,null,null,"Lookup Table"]
[null,"Basic Land Use Category","Land Use","Code","R Credit","Rv ","CN",null,null,"GI Practice","Level","Code","R Credit","Rv","Tv Multiplier"]
["Step 1   Basic Land Use","Basic Land Use","Impervious Surface","IA",{"$f":"1-F18","v":5.0000000000000044E-2},0.95,98,null,"Step 2     Intrinsic GIPs","Downspout Disconnection","A/B Soil","DAB",0.5,{"$f":"1-M18","v":0.5},0]
[null,null,"Forest A Soil","FA",0.98,0.02,36,null,null,null,"C/D Soil","DCD",0.25,0.75,0]
[null,null,"Forest B Soil","FB",0.97,0.03,60,null,null,null,"Amended","DAS",0.5,0.5,0]
[null,null,"Forest C Soil","FC",0.96,0.04,73,null,null,"Sheet Flow","Cons Area A/B","SAB",0.75,0.25,0]
[null,null,"Forest D Soil","FD",0.95,0.05,79,null,null,null,"Cons Area C/D","SCD",0.5,0.5,0]
[null,null,"Turf A Soil","TA",0.85,0.15,49,null,null,null,"Strip A","SA",0.5,0.5,0]
[null,null,"Turf B Soil","TB",0.82000000000000006,0.18,69,null,null,null,"Strip Amended","SAS",0.5,0.5,0]
[null,null,"Turf C Soil","TC",0.8,0.2,79,null,"Step 3 & 3a Structural GIPs","Permeable Pavement\n(see Notes below)",1,"P1",0.45,{"$f":"1-M25","v":0.55000000000000004},1]
[null,null,"Turf D Soil","TD",{"$f":"1-F26","v":0.77},0.23,84,null,null,null,"1 (P1 Land Use)","PP1",0,{"$f":"1-M26","v":1},1]
[null,null,"Gravel A Soil","GRA",0.4,0.6,76,null,null,null,"2 (No Run on)*","P2",0,{"$f":"1-M27","v":1},1.1000000000000001]
[null,null,"Gravel B Soil","GRB",0.4,0.6,85,null,null,"Grass Channel","A/B Soil","GAB",0.2,{"$f":"1-M28","v":0.8},0]
[null,null,"Gravel C Soil","GRC",0.4,0.6,89,null,null,null,"C/D Soil","GCD",0.1,0.9,0]
[null,null,"Gravel D Soil","GRD",0.4,0.6,91,null,null,null,"A/B Amended","GAA",0.3,0.7,0]
{"$rows_left_out":15}
{"sheet":"Rv and Adjusted CN","index":1,"n_rows":63,"n_cols":50,"rows_kept":63,"cut":false,"hidden":false,"merged":[[0,37,0,44],[91,0,91,3],[16,23,16,24],[16,27,16,30],[16,31,16,37],[16,39,16,42],[58,15,60,15],[58,16,60,16],[58,21,60,21],[58,22,60,22],[60,0,60,3],[16,43,16,49],[14,20,15,22],[15,27,15,37],[15,39,15,49],[16,0,16,4],[16,21,16,22],[6,26,6,27],[9,0,9,2],[9,4,9,5],[10,0,10,2],[14,0,15,4],[14,5,15,7],[14,8,15,10],[14,11,15,13],[14,14,15,16],[14,17,15,19],[16,5,16,7],[16,8,16,10],[16,11,16,13],[16,15,16,16],[16,17,16,19],[1,0,1,3],[1,4,1,8],[1,26,1,30],[1,31,1,35],[0,0,0,3],[0,4,0,8],[0,26,0,30],[0,31,0,35],[0,10,0,17]]}
["Project Name",null,null,null,{"$f":"'Cover Sheet'!C1","v":0},null,null,null,null,null,"MWS LID SITE DESIGN TOOL VERSION 9 - August 1, 2016",null,null,null,null,null,null,null,null,null,null,null,null,null,null,null,"Project Name",null,null,null,null,{"$f":"'Cover Sheet'!C1","v":0},null,null,null,null,null,"MWS LID SITE DESIGN TOOL VERSION 9 - August 1, 2016"]
["Parcel Identification #",null,null,null,{"$f":"'Cover Sheet'!C2","v":0},null,null,null,null,null,null,null,null,null,null,null,null,null,null,null,null,null,null,null,null,null,"Parcel Identification #",null,null,null,null,{"$f":"'Cover Sheet'!C2","v":0}]
["Combined Sewer Overlay?"]
["Pre-Development Impervious Area (acres)"]
["Post-Development Impervious Area (acres)",null,null,null,null,null,null,null,null,null,null,null,null,null,null,null,null,null,null,null,null,null,null,null,null,null,"PreDev \nCN"]
["Pre-Development Rv ="]
["Target Runoff Reduction Requirement =",null,null,null,0.8,"See Section 7.2.1 in Metro SWMM Volume 1",null,null,null,null,null,null,null,null,null,null,null,null,null,null,null,null,null,null,null,null,"METRO RAINFALL"]
[null,null,null,null,null,null,null,null,null,null,null,null,null,null,null,null,null,null,null,null,null,null,null,null,null,null,"Return\n Period","Rainfall\n(in)"]
[null,null,null,null,null,null,null,null,null,null,null,null,null,null,null,null,null,null,null,null,null,null,null,null,null,null,"2-yr",3.39]
["Capture Depth=",null,null,1,"inch",null,null,null,null,null,null,null,null,null,null,null,null,null,null,null,null,null,null,null,null,null,"5-yr",4.5]
["Cistern Capture=",null,null,null,"% Total Vol captured",null,null,"From Cistern Design Tool",null,null,null,null,null,null,null,null,null,null,null,null,null,null,null,null,null,null,"10-yr",5.23]
[null,null,null,null,null,null,null,null,null,null,null,null,null,null,null,null,null,null,null,null,null,null,null,null,null,null,"25-yr",6.16]
[null,null,null,null,null,null,null,null,null,null,null,null,null,null,null,null,null,null,null,null,null,null,null,null,null,null,"50-yr",6.85]
["Percent Volume Reduction-Based Calculations",null,null,null,null,null,null,null,null,null,null,null,null,null,null,null,null,null,null,null,null,null,null,null,null,null,"100-yr",7.53]
["Step 1: Lay out the site and divide it into sub-areas each of a specific land use type and Rv.",null,null,null,null,"Step 1a: Change any basic land use types through reforesting, permeable pavement or green roofs - or through use of open space for a GIP.",null,null,"Step 2: Treat impervious areas through the use of disconnection or sheet flow",null,null,"Step 3: Treat primarily impervious areas with structural GIPs either in series with Step 3 intrinsic GIPs or alone downstream from Steps 1 and 2 land use.",null,null," Size controls for Step 3 by assigning structure ID to each sub-area, combining sub-areas into one structure if appropriate.",null,null,"Step 3a Treatment in Series Calculation - Place Structural GIPs in same row as upstream GIP ",null,null,"Size controls for Step 3a in series by assigning a sequential structure ID to each area treated in series."]
[null,null,null,null,null,null,null,null,null,null,null,null,null,null,null,null,null,null,null,null,null,null,null,null,null,null,null,"Adjusted Curve Number Calculations (Step 3 only)",null,null,null,null,null,null,null,null,null,null,null,"Adjusted Curve Number Calculations (Step 3a added)"]
["Step1 Basic Land Use",null,null,null,null,"Step 1a Modified LU",null,null,"Step 2 Intrinsic GIPs",null,null,"Step 3 Structural GIPs",null,null,"Structure ID","IA Capture",null,"Step 3a Structural GIPs in Series",null,null,"Structure ID","IA Capture",null,"Nominal Curve Number",null,null,null,"No Controls",null,null,null,"With Structural Controls &Treatment Vol Removed",null,null,null,null,null,null,null,"No Controls",null,null,null,"With Structural Controls &Treatment Vol Removed"]
["Subarea","Description","Code","Acres","Base Rv","Code",{"$f":"D18","v":"Acres"},"Eff Rv1","Code","Trtmt VR1","Eff Rv2","Code","Trtmt VR2","Eff Rv3",null,"Tv Multiplier","Tv (cf)","Code","Trtmt VR2","Eff Rv4","Site GIP ID Number","Tv Multiplier","Structure in Series Tv (cf)","Step 1","Step 1A",null,null,"Original CN","Rainfall (in)","S (in)","Q (in)","Tv required\n(cu ft)","Tv provided \n(%)","RO Vol \nRed (cu ft)","Q reduction (in)","Q adj (in)","Adjusted CN","Difference",null,"Adjusted\nCN (St 3)","Rainfall (in)","S (in)","Q (in)","Tv required\n(cu ft)","Tv provided \n(%)","RO Vol \nRed (cu ft)","Q reduction (in)","Q adj (in)","Adjusted CN","Difference"]
[1,null,null,null,{"$f":"IF($G19=0,0,VLOOKUP(C19,'Cover Sheet'!$D$18:$F$30,3,0))","v":0},null,0,{"$f":"IF($G19=0,0,VLOOKUP(F19,'Cover Sheet'!$D$18:$F$42,3,0))","v":0},null,{"$f":"IF(I19=0,0,VLOOKUP(I19,'Cover Sheet'!$L$18:$M$24,2,0))","v":0},{"$f":"IF(J19>0,H19*(1-J19),H19)","v":0},null,{"$f":"IF(L19=0,0,VLOOKUP(L19,'Cover Sheet'!$L$25:$M$40,2,0))","v":0},{"$f":"IF(M19>0,ROUNDUP(K19*(1-M19),2),K19)","v":0},null,{"$f":"IF(L19=\"\",0,VLOOKUP(L19,'Cover Sheet'!$L$18:$O$40,4,0))","v":0},{"$f":"IF(L19=\"\",\"-\",IF(OR(L19=\"PP1\",L19=\"P2\"),P19*$D$10*E19*G19/12*43560,P19*$D$10*K19*G19/12*43560))","v":"-"},null,{"$f":"IF(R19=0,0,VLOOKUP(R19,'Cover Sheet'!$L$25:$M$40,2,0))","v":0},{"$f":"IF(S19>0,N19*(1-S19),N19)","v":0},null,{"$f":"IF(R19=\"\",0,VLOOKUP(R19,'Cover Sheet'!$L$18:$O$40,4,0))","v":0},{"$f":"IF(R19=\"\",\"-\",V19*$D$10*N19*G19/12*43560)","v":"-"},{"$f":"IF(C19=0,0,VLOOKUP(C19,'Cover Sheet'!$D$18:$G$30,4,0))","v":0},{"$f":"IF(F19=0,0,VLOOKUP(F19,'Cover Sheet'!$D$18:$G$42,4,0))","v":0},null,null,{"$f":"Y19","v":0},7.53,{"$f":"IF(AB19=0,\"-\",1000/AB19-10)","v":"-"},{"$f":"IF(AB19=0,\"-\",(AC19-0.2*AD19)^2/(AC19+0.8*AD19))","v":"-"},{"$f":"Q19","v":"-"},null,{"$f":"IF(AG19=\"\",\"\",AF19*AG19)","v":""},{"$f":"IF(OR(AB19=0,L19=\"\"),0,12*AH19/43560/D19)","v":0},{"$f":"IF(AB19=0,\"-\",AE19-AI19)","v":"-"},{"$f":"IF(AB19=0,0,1000/(10+5*AC19+10*AJ19-10*(AJ19^2+1.25*AJ19*AC19)^(1/2)))","v":0},{"$f":"AK19-AB19","v":0},null,{"$f":"AK19","v":0},7.53,{"$f":"IF(AN19=0,\"-\",1000/AN19-10)","v":"-"},{"$f":"IF(AN19=0,\"-\",(AO19-0.2*AP19)^2/(AO19+0.8*AP19))","v":"-"},{"$f":"W19","v":"-"},1,{"$f":"IF(AS19=\"\",\"\",AR19*AS19)","v":{"$error":"#VALUE!"}},{"$f":"IF(OR(AN19=0,R19=\"\"),0,12*AT19/43560/D19)","v":0},{"$f":"IF(AN19=0,\"-\",AQ19-AU19)","v":"-"},{"$f":"IF(AN19=0,0,1000/(10+5*AO19+10*AV19-10*(AV19^2+1.25*AV19*AO19)^(1/2)))","v":0},{"$f":"AW19-AN19","v":0}]
[{"$f":"A19+1","v":2},null,null,null,{"$f":"IF($G20=0,0,VLOOKUP(C20,'Cover Sheet'!$D$18:$F$30,3,0))","v":0},null,0,{"$f":"IF($G20=0,0,VLOOKUP(F20,'Cover Sheet'!$D$18:$F$42,3,0))","v":0},null,{"$f":"IF(I20=0,0,VLOOKUP(I20,'Cover Sheet'!$L$18:$M$24,2,0))","v":0},{"$f":"IF(J20>0,H20*(1-J20),H20)","v":0},null,{"$f":"IF(L20=0,0,VLOOKUP(L20,'Cover Sheet'!$L$25:$M$40,2,0))","v":0},{"$f":"IF(M20>0,ROUNDUP(K20*(1-M20),2),K20)","v":0},null,{"$f":"IF(L20=\"\",0,VLOOKUP(L20,'Cover Sheet'!$L$18:$O$40,4,0))","v":0},{"$f":"IF(L20=\"\",\"-\",IF(OR(L20=\"PP1\",L20=\"P2\"),P20*$D$10*E20*G20/12*43560,P20*$D$10*K20*G20/12*43560))","v":"-"},null,{"$f":"IF(R20=0,0,VLOOKUP(R20,'Cover Sheet'!$L$25:$M$40,2,0))","v":0},{"$f":"IF(S20>0,N20*(1-S20),N20)","v":0},null,{"$f":"IF(R20=\"\",0,VLOOKUP(R20,'Cover Sheet'!$L$18:$O$40,4,0))","v":0},"-",{"$f":"IF(C20=0,0,VLOOKUP(C20,'Cover Sheet'!$D$18:$G$30,4,0))","v":0},{"$f":"IF(F20=0,0,VLOOKUP(F20,'Cover Sheet'!$D$18:$G$42,4,0))","v":0},null,null,{"$f":"Y20","v":0},{"$f":"$AC$19","v":7.53},"-",{"$f":"IF(AB20=0,\"-\",(AC20-0.2*AD20)^2/(AC20+0.8*AD20))","v":"-"},{"$f":"Q20","v":"-"},null,{"$f":"IF(AG20=\"\",\"\",AF20*AG20)","v":""},0,"-",{"$f":"IF(AB20=0,0,1000/(10+5*AC20+10*AJ20-10*(AJ20^2+1.25*AJ20*AC20)^(1/2)))","v":0},{"$f":"AK20-AB20","v":0},null,{"$f":"AK20","v":0},{"$f":"$AC$19","v":7.53},"-","-",{"$f":"W20","v":"-"},null,{"$f":"IF(AS20=\"\",\"\",AR20*AS20)","v":""},{"$f":"IF(OR(AN20=0,R20=\"\"),0,12*AT20/43560/D20)","v":0},"-",0,{"$f":"AW20-AN20","v":0}]
[{"$f":"A20+1","v":3},null,null,null,{"$f":"IF($G21=0,0,VLOOKUP(C21,'Cover Sheet'!$D$18:$F$30,3,0))","v":0},null,0,{"$f":"IF($G21=0,0,VLOOKUP(F21,'Cover Sheet'!$D$18:$F$42,3,0))","v":0},null,{"$f":"IF(I21=0,0,VLOOKUP(I21,'Cover Sheet'!$L$18:$M$24,2,0))","v":0},0,null,{"$f":"IF(L21=0,0,VLOOKUP(L21,'Cover Sheet'!$L$25:$M$40,2,0))","v":0},0,null,{"$f":"IF(L21=\"\",0,VLOOKUP(L21,'Cover Sheet'!$L$18:$O$40,4,0))","v":0},{"$f":"IF(L21=\"\",\"-\",IF(OR(L21=\"PP1\",L21=\"P2\"),P21*$D$10*E21*G21/12*43560,P21*$D$10*K21*G21/12*43560))","v":"-"},null,{"$f":"IF(R21=0,0,VLOOKUP(R21,'Cover Sheet'!$L$25:$M$40,2,0))","v":0},{"$f":"IF(S21>0,N21*(1-S21),N21)","v":0},null,{"$f":"IF(R21=\"\",0,VLOOKUP(R21,'Cover Sheet'!$L$18:$O$40,4,0))","v":0},"-",{"$f":"IF(C21=0,0,VLOOKUP(C21,'Cover Sheet'!$D$18:$G$30,4,0))","v":0},{"$f":"IF(F21=0,0,VLOOKUP(F21,'Cover Sheet'!$D$18:$G$42,4,0))","v":0},null,null,0,{"$f":"$AC$19","v":7.53},"-","-",{"$f":"Q21","v":"-"},null,"",0,"-",0,0,null,0,{"$f":"$AC$19","v":7.53},"-","-","-",null,"",0,"-",0,0]
[4,null,null,null,{"$f":"IF($G22=0,0,VLOOKUP(C22,'Cover Sheet'!$D$18:$F$30,3,0))","v":0},null,0,{"$f":"IF($G22=0,0,VLOOKUP(F22,'Cover Sheet'!$D$18:$F$42,3,0))","v":0},null,{"$f":"IF(I22=0,0,VLOOKUP(I22,'Cover Sheet'!$L$18:$M$24,2,0))","v":0},0,null,{"$f":"IF(L22=0,0,VLOOKUP(L22,'Cover Sheet'!$L$25:$M$40,2,0))","v":0},0,null,{"$f":"IF(L22=\"\",0,VLOOKUP(L22,'Cover Sheet'!$L$18:$O$40,4,0))","v":0},"-",null,{"$f":"IF(R22=0,0,VLOOKUP(R22,'Cover Sheet'!$L$25:$M$40,2,0))","v":0},0,null,{"$f":"IF(R22=\"\",0,VLOOKUP(R22,'Cover Sheet'!$L$18:$O$40,4,0))","v":0},"-",{"$f":"IF(C22=0,0,VLOOKUP(C22,'Cover Sheet'!$D$18:$G$30,4,0))","v":0},{"$f":"IF(F22=0,0,VLOOKUP(F22,'Cover Sheet'!$D$18:$G$42,4,0))","v":0},null,null,0,7.53,"-","-","-",null,"",0,"-",0,0,null,0,7.53,"-","-","-",null,"",0,"-",0,0]
[5,null,null,null,{"$f":"IF($G23=0,0,VLOOKUP(C23,'Cover Sheet'!$D$18:$F$30,3,0))","v":0},null,0,{"$f":"IF($G23=0,0,VLOOKUP(F23,'Cover Sheet'!$D$18:$F$42,3,0))","v":0},null,{"$f":"IF(I23=0,0,VLOOKUP(I23,'Cover Sheet'!$L$18:$M$24,2,0))","v":0},0,null,{"$f":"IF(L23=0,0,VLOOKUP(L23,'Cover Sheet'!$L$25:$M$40,2,0))","v":0},0,null,{"$f":"IF(L23=\"\",0,VLOOKUP(L23,'Cover Sheet'!$L$18:$O$40,4,0))","v":0},"-",null,{"$f":"IF(R23=0,0,VLOOKUP(R23,'Cover Sheet'!$L$25:$M$40,2,0))","v":0},0,null,{"$f":"IF(R23=\"\",0,VLOOKUP(R23,'Cover Sheet'!$L$18:$O$40,4,0))","v":0},"-",{"$f":"IF(C23=0,0,VLOOKUP(C23,'Cover Sheet'!$D$18:$G$30,4,0))","v":0},{"$f":"IF(F23=0,0,VLOOKUP(F23,'Cover Sheet'!$D$18:$G$42,4,0))","v":0},null,null,0,7.53,"-","-","-",null,"",0,"-",0,0,null,0,7.53,"-","-","-",null,"",0,"-",0,0]
[6,null,null,null,{"$f":"IF($G24=0,0,VLOOKUP(C24,'Cover Sheet'!$D$18:$F$30,3,0))","v":0},null,0,{"$f":"IF($G24=0,0,VLOOKUP(F24,'Cover Sheet'!$D$18:$F$42,3,0))","v":0},null,{"$f":"IF(I24=0,0,VLOOKUP(I24,'Cover Sheet'!$L$18:$M$24,2,0))","v":0},0,null,{"$f":"IF(L24=0,0,VLOOKUP(L24,'Cover Sheet'!$L$25:$M$40,2,0))","v":0},0,null,{"$f":"IF(L24=\"\",0,VLOOKUP(L24,'Cover Sheet'!$L$18:$O$40,4,0))","v":0},"-",null,{"$f":"IF(R24=0,0,VLOOKUP(R24,'Cover Sheet'!$L$25:$M$40,2,0))","v":0},0,null,{"$f":"IF(R24=\"\",0,VLOOKUP(R24,'Cover Sheet'!$L$18:$O$40,4,0))","v":0},"-",{"$f":"IF(C24=0,0,VLOOKUP(C24,'Cover Sheet'!$D$18:$G$30,4,0))","v":0},{"$f":"IF(F24=0,0,VLOOKUP(F24,'Cover Sheet'!$D$18:$G$42,4,0))","v":0},null,null,0,7.53,"-","-","-",null,"",0,"-",0,0,null,0,7.53,"-","-","-",null,"",0,"-",0,0]
[7,null,null,null,{"$f":"IF($G25=0,0,VLOOKUP(C25,'Cover Sheet'!$D$18:$F$30,3,0))","v":0},null,0,{"$f":"IF($G25=0,0,VLOOKUP(F25,'Cover Sheet'!$D$18:$F$42,3,0))","v":0},null,{"$f":"IF(I25=0,0,VLOOKUP(I25,'Cover Sheet'!$L$18:$M$24,2,0))","v":0},0,null,{"$f":"IF(L25=0,0,VLOOKUP(L25,'Cover Sheet'!$L$25:$M$40,2,0))","v":0},0,null,{"$f":"IF(L25=\"\",0,VLOOKUP(L25,'Cover Sheet'!$L$18:$O$40,4,0))","v":0},"-",null,{"$f":"IF(R25=0,0,VLOOKUP(R25,'Cover Sheet'!$L$25:$M$40,2,0))","v":0},0,null,{"$f":"IF(R25=\"\",0,VLOOKUP(R25,'Cover Sheet'!$L$18:$O$40,4,0))","v":0},"-",{"$f":"IF(C25=0,0,VLOOKUP(C25,'Cover Sheet'!$D$18:$G$30,4,0))","v":0},{"$f":"IF(F25=0,0,VLOOKUP(F25,'Cover Sheet'!$D$18:$G$42,4,0))","v":0},null,null,0,7.53,"-","-","-",null,"",0,"-",0,0,null,0,7.53,"-","-","-",null,"",0,"-",0,0]
[8,null,null,null,{"$f":"IF($G26=0,0,VLOOKUP(C26,'Cover Sheet'!$D$18:$F$30,3,0))","v":0},null,0,{"$f":"IF($G26=0,0,VLOOKUP(F26,'Cover Sheet'!$D$18:$F$42,3,0))","v":0},null,{"$f":"IF(I26=0,0,VLOOKUP(I26,'Cover Sheet'!$L$18:$M$24,2,0))","v":0},0,null,{"$f":"IF(L26=0,0,VLOOKUP(L26,'Cover Sheet'!$L$25:$M$40,2,0))","v":0},0,null,{"$f":"IF(L26=\"\",0,VLOOKUP(L26,'Cover Sheet'!$L$18:$O$40,4,0))","v":0},"-",null,{"$f":"IF(R26=0,0,VLOOKUP(R26,'Cover Sheet'!$L$25:$M$40,2,0))","v":0},0,null,{"$f":"IF(R26=\"\",0,VLOOKUP(R26,'Cover Sheet'!$L$18:$O$40,4,0))","v":0},"-",{"$f":"IF(C26=0,0,VLOOKUP(C26,'Cover Sheet'!$D$18:$G$30,4,0))","v":0},{"$f":"IF(F26=0,0,VLOOKUP(F26,'Cover Sheet'!$D$18:$G$42,4,0))","v":0},null,null,0,7.53,"-","-","-",null,"",0,"-",0,0,null,0,7.53,"-","-","-",null,"",0,"-",0,0]
[9,null,null,null,{"$f":"IF($G27=0,0,VLOOKUP(C27,'Cover Sheet'!$D$18:$F$30,3,0))","v":0},null,0,{"$f":"IF($G27=0,0,VLOOKUP(F27,'Cover Sheet'!$D$18:$F$42,3,0))","v":0},null,{"$f":"IF(I27=0,0,VLOOKUP(I27,'Cover Sheet'!$L$18:$M$24,2,0))","v":0},0,null,{"$f":"IF(L27=0,0,VLOOKUP(L27,'Cover Sheet'!$L$25:$M$40,2,0))","v":0},0,null,{"$f":"IF(L27=\"\",0,VLOOKUP(L27,'Cover Sheet'!$L$18:$O$40,4,0))","v":0},"-",null,{"$f":"IF(R27=0,0,VLOOKUP(R27,'Cover Sheet'!$L$25:$M$40,2,0))","v":0},0,null,{"$f":"IF(R27=\"\",0,VLOOKUP(R27,'Cover Sheet'!$L$18:$O$40,4,0))","v":0},"-",{"$f":"IF(C27=0,0,VLOOKUP(C27,'Cover Sheet'!$D$18:$G$30,4,0))","v":0},{"$f":"IF(F27=0,0,VLOOKUP(F27,'Cover Sheet'!$D$18:$G$42,4,0))","v":0},null,null,0,7.53,"-","-","-",null,"",0,"-",0,0,null,0,7.53,"-","-","-",null,"",0,"-",0,0]
[10,null,null,null,{"$f":"IF($G28=0,0,VLOOKUP(C28,'Cover Sheet'!$D$18:$F$30,3,0))","v":0},null,0,{"$f":"IF($G28=0,0,VLOOKUP(F28,'Cover Sheet'!$D$18:$F$42,3,0))","v":0},null,{"$f":"IF(I28=0,0,VLOOKUP(I28,'Cover Sheet'!$L$18:$M$24,2,0))","v":0},0,null,{"$f":"IF(L28=0,0,VLOOKUP(L28,'Cover Sheet'!$L$25:$M$40,2,0))","v":0},0,null,{"$f":"IF(L28=\"\",0,VLOOKUP(L28,'Cover Sheet'!$L$18:$O$40,4,0))","v":0},"-",null,{"$f":"IF(R28=0,0,VLOOKUP(R28,'Cover Sheet'!$L$25:$M$40,2,0))","v":0},0,null,{"$f":"IF(R28=\"\",0,VLOOKUP(R28,'Cover Sheet'!$L$18:$O$40,4,0))","v":0},"-",{"$f":"IF(C28=0,0,VLOOKUP(C28,'Cover Sheet'!$D$18:$G$30,4,0))","v":0},{"$f":"IF(F28=0,0,VLOOKUP(F28,'Cover Sheet'!$D$18:$G$42,4,0))","v":0},null,null,0,7.53,"-","-","-",null,"",0,"-",0,0,null,0,7.53,"-","-","-",null,"",0,"-",0,0]
[11,null,null,null,{"$f":"IF($G29=0,0,VLOOKUP(C29,'Cover Sheet'!$D$18:$F$30,3,0))","v":0},null,0,{"$f":"IF($G29=0,0,VLOOKUP(F29,'Cover Sheet'!$D$18:$F$42,3,0))","v":0},null,{"$f":"IF(I29=0,0,VLOOKUP(I29,'Cover Sheet'!$L$18:$M$24,2,0))","v":0},0,null,{"$f":"IF(L29=0,0,VLOOKUP(L29,'Cover Sheet'!$L$25:$M$40,2,0))","v":0},0,null,{"$f":"IF(L29=\"\",0,VLOOKUP(L29,'Cover Sheet'!$L$18:$O$40,4,0))","v":0},"-",null,{"$f":"IF(R29=0,0,VLOOKUP(R29,'Cover Sheet'!$L$25:$M$40,2,0))","v":0},0,null,{"$f":"IF(R29=\"\",0,VLOOKUP(R29,'Cover Sheet'!$L$18:$O$40,4,0))","v":0},"-",{"$f":"IF(C29=0,0,VLOOKUP(C29,'Cover Sheet'!$D$18:$G$30,4,0))","v":0},{"$f":"IF(F29=0,0,VLOOKUP(F29,'Cover Sheet'!$D$18:$G$42,4,0))","v":0},null,null,0,7.53,"-","-","-",null,"",0,"-",0,0,null,0,7.53,"-","-","-",null,"",0,"-",0,0]
[12,null,null,null,{"$f":"IF($G30=0,0,VLOOKUP(C30,'Cover Sheet'!$D$18:$F$30,3,0))","v":0},null,0,{"$f":"IF($G30=0,0,VLOOKUP(F30,'Cover Sheet'!$D$18:$F$42,3,0))","v":0},null,{"$f":"IF(I30=0,0,VLOOKUP(I30,'Cover Sheet'!$L$18:$M$24,2,0))","v":0},0,null,{"$f":"IF(L30=0,0,VLOOKUP(L30,'Cover Sheet'!$L$25:$M$40,2,0))","v":0},0,null,{"$f":"IF(L30=\"\",0,VLOOKUP(L30,'Cover Sheet'!$L$18:$O$40,4,0))","v":0},"-",null,{"$f":"IF(R30=0,0,VLOOKUP(R30,'Cover Sheet'!$L$25:$M$40,2,0))","v":0},0,null,{"$f":"IF(R30=\"\",0,VLOOKUP(R30,'Cover Sheet'!$L$18:$O$40,4,0))","v":0},"-",{"$f":"IF(C30=0,0,VLOOKUP(C30,'Cover Sheet'!$D$18:$G$30,4,0))","v":0},{"$f":"IF(F30=0,0,VLOOKUP(F30,'Cover Sheet'!$D$18:$G$42,4,0))","v":0},null,null,0,7.53,"-",{"$f":"IF(AB30=0,\"-\",(AC30-0.2*AD30)^2/(AC30+0.8*AD30))","v":"-"},"-",null,"",0,"-",0,0,null,0,7.53,"-",{"$f":"IF(AN30=0,\"-\",(AO30-0.2*AP30)^2/(AO30+0.8*AP30))","v":"-"},"-",null,"",0,"-",0,0]
{"$rows_left_out":34}
{"sheet":"Sheet1","index":2,"n_rows":0,"n_cols":0,"rows_kept":0,"cut":false,"hidden":false,"merged":[]}